Kandy-n
type: LexicalEntry
canonical form: Kandy
sense: 08737538-n
part of speech: noun

08737538-n
type: LexicalConcept
in scheme: en-word.net
definition: a city of central Sri Lanka that was the last capital of the ancient kings of Ceylon; a resort and religious center
ili: i82722
lexfile: noun.location
part of speech: noun
instance hypernym: 08542298-n