Central African Republic-n
type: LexicalEntry
canonical form: Central African Republic
sense: 08736410-n
part of speech: noun

Central Africa-n
type: LexicalEntry
canonical form: Central Africa
sense: 08736410-n
part of speech: noun

08736410-n
type: LexicalConcept
in scheme: en-word.net
definition: a landlocked country in central Africa; formerly under French control; became independent in 1960
ili: i82717
lexfile: noun.location
part of speech: noun
instance hypernym: 08716193-n
mero part: 08736634-n