tack-n
type: LexicalEntry
canonical form: tack
sense: 08698822-n
part of speech: noun

08698822-n
type: LexicalConcept
in scheme: en-word.net
definition: the heading or position of a vessel relative to the trim of its sails
ili: i82561
lexfile: noun.location
part of speech: noun
hypernym: 08698626-n