vantage point-n
type: LexicalEntry
canonical form: vantage point
sense: 08694988-n
part of speech: noun

viewpoint-n
type: LexicalEntry
canonical form: viewpoint
sense: 08694988-n
part of speech: noun

08694988-n
type: LexicalConcept
in scheme: en-word.net
definition: a place from which something can be viewed
example: from that vantage point he could survey the whole valley
ili: i82538
lexfile: noun.location
part of speech: noun
hypernym: 08694813-n