sphere-n
type: LexicalEntry
canonical form: sphere
sense: 08671145-n
part of speech: noun

sphere of influence-n
type: LexicalEntry
canonical form: sphere of influence
sense: 08671145-n
part of speech: noun

08671145-n
type: LexicalConcept
in scheme: en-word.net
definition: the geographical area in which one nation is very influential
ili: i82448
lexfile: noun.location
part of speech: noun
hypernym: 08591861-n