orbit-n
type: LexicalEntry
canonical form: orbit
sense: 08629897-n
part of speech: noun

electron orbit-n
type: LexicalEntry
canonical form: electron orbit
sense: 08629897-n
part of speech: noun

08629897-n
type: LexicalConcept
in scheme: en-word.net
definition: the path of an electron around the nucleus of an atom
ili: i82239
lexfile: noun.location
part of speech: noun
hypernym: 08633886-n