key-n
type: LexicalEntry
canonical form: key
sense: 08608465-n
part of speech: noun

paint-n
type: LexicalEntry
canonical form: paint
sense: 08608465-n
part of speech: noun

08608465-n
type: LexicalConcept
in scheme: en-word.net
definition: (basketball) a space (including the foul line) in front of the basket at each end of a basketball court; usually painted a different color from the rest of the court
example: he hit a jump shot from the top of the key
example: he dominates play in the paint
ili: i82125
lexfile: noun.location
part of speech: noun
domain topic: 00482004-n
hypernym: 08670545-n
mero part: 08590557-n