field-n
type: LexicalEntry
canonical form: field
sense: 08587527-n
part of speech: noun

08587527-n
type: LexicalConcept
in scheme: en-word.net
definition: a piece of land cleared of trees and usually enclosed
example: he planted a field of wheat
ili: i82019
lexfile: noun.location
part of speech: noun
hypernym: 08691133-n