extremity-n
type: LexicalEntry
canonical form: extremity
sense: 08586507-n
part of speech: noun

08586507-n
type: LexicalConcept
in scheme: en-word.net
definition: the outermost or farthest region or point
ili: i82013
lexfile: noun.location
part of speech: noun
hypernym: 08647614-n