setting-n
type: LexicalEntry
canonical form: setting
sense: 08585785-n
part of speech: noun

scene-n
type: LexicalEntry
canonical form: scene
sense: 08585785-n
part of speech: noun

08585785-n
type: LexicalConcept
in scheme: en-word.net
definition: the context and environment in which something is set
example: the perfect setting for a ghost story
ili: i82009
lexfile: noun.location
part of speech: noun
hypernym: 08584764-n