addition-n
type: LexicalEntry
canonical form: addition
sense: 08572409-n
part of speech: noun

08572409-n
type: LexicalConcept
in scheme: en-word.net
definition: a suburban area laid out in streets and lots for a future residential area
ili: i81934
lexfile: noun.location
part of speech: noun
hypernym: 08571977-n