arena-n
type: LexicalEntry
canonical form: arena
sense: 08514117-n
part of speech: noun

08514117-n
type: LexicalConcept
in scheme: en-word.net
definition: the central area of an ancient Roman amphitheater where contests and spectacles were held; especially an area that was strewn with sand
ili: i81709
lexfile: noun.location
part of speech: noun
hypernym: 08514304-n