address-n
type: LexicalEntry
canonical form: address
sense: 08508037-n
part of speech: noun

08508037-n
type: LexicalConcept
in scheme: en-word.net
definition: the place where a person or organization can be found or communicated with
ili: i81677
lexfile: noun.location
part of speech: noun
hypernym: 08596234-n