staff-n
type: LexicalEntry
canonical form: staff
sense: 08456947-n
part of speech: noun

08456947-n
type: LexicalConcept
in scheme: en-word.net
definition: personnel who assist their superior in carrying out an assigned task
example: the hospital has an excellent nursing staff
example: the general relied on his staff to make routine decisions
ili: i81476
lexfile: noun.group
part of speech: noun
hypernym: 08224937-n
mero member: 10664037-n