browse-n
type: LexicalEntry
canonical form: browse
sense: 08454309-n
part of speech: noun

08454309-n
type: LexicalConcept
in scheme: en-word.net
definition: vegetation (such as young shoots, twigs, and leaves) that is suitable for animals to eat
example: a deer needs to eat twenty pounds of browse every day
ili: i81458
lexfile: noun.group
part of speech: noun
hypernym: 08453769-n