traffic-n
type: LexicalEntry
canonical form: traffic
sense: 08442260-n
part of speech: noun

08442260-n
type: LexicalConcept
in scheme: en-word.net
definition: the aggregation of things (pedestrians or vehicles) coming and going in a particular locality during a specified period of time
ili: i81388
lexfile: noun.group
part of speech: noun
hypernym: 07968050-n