right-n
type: LexicalEntry
canonical form: right
sense: 08433609-n
part of speech: noun

right wing-n
type: LexicalEntry
canonical form: right wing
sense: 08433609-n
part of speech: noun

08433609-n
type: LexicalConcept
in scheme: en-word.net
definition: those who support political or social or economic conservatism; those who believe that things are better left unchanged
ili: i81342
lexfile: noun.group
part of speech: noun
hypernym: 08268798-n