fair-n
type: LexicalEntry
canonical form: fair
sense: 08425514-n
part of speech: noun

08425514-n
type: LexicalConcept
in scheme: en-word.net
definition: gathering of producers to promote business
example: world fair
example: trade fair
example: book fair
ili: i81293
lexfile: noun.group
part of speech: noun
hypernym: 01232427-n