nobility-n
type: LexicalEntry
canonical form: nobility
sense: 08404938-n
part of speech: noun

aristocracy-n
type: LexicalEntry
canonical form: aristocracy
sense: 08404938-n
part of speech: noun

08404938-n
type: LexicalConcept
in scheme: en-word.net
definition: a privileged class holding hereditary titles
ili: i81190
lexfile: noun.group
part of speech: noun
hypernym: 08403286-n
mero member: 09827177-n