tryst-n
type: LexicalEntry
canonical form: tryst
sense: 08402448-n
part of speech: noun

rendezvous-n
type: LexicalEntry
canonical form: rendezvous
sense: 08402448-n
part of speech: noun

08402448-n
type: LexicalConcept
in scheme: en-word.net
definition: a date; usually with a member of the opposite sex
ili: i81173
lexfile: noun.group
part of speech: noun
hypernym: 08401740-n