economy-n
type: LexicalEntry
canonical form: economy
sense: 08383680-n
part of speech: noun

economic system-n
type: LexicalEntry
canonical form: economic system
sense: 08383680-n
part of speech: noun

08383680-n
type: LexicalConcept
in scheme: en-word.net
definition: the system of production and distribution and consumption
ili: i81079
lexfile: noun.group
part of speech: noun
hypernym: 08452398-n
mero part: 07983333-n
mero part: 08381475-n