monarchy-n
type: LexicalEntry
canonical form: monarchy
sense: 08380739-n
part of speech: noun

08380739-n
type: LexicalConcept
in scheme: en-word.net
definition: an autocracy governed by a monarch who usually inherits the authority
ili: i81063
lexfile: noun.group
part of speech: noun
hypernym: 08377928-n