republic-n
type: LexicalEntry
canonical form: republic
sense: 08379844-n
part of speech: noun

08379844-n
type: LexicalConcept
in scheme: en-word.net
definition: a form of government whose head of state is not a monarch
example: the head of state in a republic is usually a president
ili: i81058
lexfile: noun.group
part of speech: noun
hypernym: 08384807-n