court-n
type: LexicalEntry
canonical form: court
sense: 08346249-n
part of speech: noun

royal court-n
type: LexicalEntry
canonical form: royal court
sense: 08346249-n
part of speech: noun

08346249-n
type: LexicalConcept
in scheme: en-word.net
definition: the family and retinue of a sovereign or prince
ili: i80906
lexfile: noun.group
part of speech: noun
hypernym: 08446124-n