council-n
type: LexicalEntry
canonical form: council
sense: 08327879-n
part of speech: noun

08327879-n
type: LexicalConcept
in scheme: en-word.net
definition: a body serving in an administrative capacity
example: student council
ili: i80810
lexfile: noun.group
part of speech: noun
hypernym: 08094128-n