congress-n
type: LexicalEntry
canonical form: congress
sense: 08325730-n
part of speech: noun

08325730-n
type: LexicalConcept
in scheme: en-word.net
definition: a meeting of elected or appointed representatives
ili: i80797
lexfile: noun.group
part of speech: noun
hypernym: 08324519-n