madrasa-n
type: LexicalEntry
canonical form: madrasa
sense: 08300101-n
part of speech: noun

madrasah-n
type: LexicalEntry
canonical form: madrasah
sense: 08300101-n
part of speech: noun

08300101-n
type: LexicalConcept
in scheme: en-word.net
definition: Muslim schools in Bangladesh and Pakistan
example: the Pakistan government decided to close down madrasas that provided military training for their students
example: many madrasas in Bangladesh are supported with money from Saudi Arabia
ili: i80672
lexfile: noun.group
part of speech: noun
domain region: 08867723-n
domain region: 08998272-n
hypernym: 08300975-n