machine-n
type: LexicalEntry
canonical form: machine
sense: 08281504-n
part of speech: noun

political machine-n
type: LexicalEntry
canonical form: political machine
sense: 08281504-n
part of speech: noun

08281504-n
type: LexicalConcept
in scheme: en-word.net
definition: a group that controls the activities of a political party
example: he was endorsed by the Democratic machine
ili: i80563
lexfile: noun.group
part of speech: noun
hypernym: 08024893-n