reception-n
type: LexicalEntry
canonical form: reception
sense: 08271252-n
part of speech: noun

08271252-n
type: LexicalConcept
in scheme: en-word.net
definition: a formal party of people; as after a wedding
ili: i80509
lexfile: noun.group
part of speech: noun
hypernym: 07462241-n
mero part: 08450087-n