class-n
type: LexicalEntry
canonical form: class
sense: 08255581-n
part of speech: noun

year-n
type: LexicalEntry
canonical form: year
sense: 08255581-n
part of speech: noun

08255581-n
type: LexicalConcept
in scheme: en-word.net
definition: a body of students who graduate together
example: the class of '97
example: she was in my year at Hoehandle High
ili: i80414
lexfile: noun.group
part of speech: noun
hypernym: 07991473-n