yakuza-n
type: LexicalEntry
canonical form: yakuza
sense: 08247827-n
part of speech: noun

08247827-n
type: LexicalConcept
in scheme: en-word.net
definition: organized crime in Japan; an alliance of criminal organizations and illegal enterprises
ili: i80371
lexfile: noun.group
part of speech: noun
domain region: 08941623-n
exemplifies: 06730109-n
hypernym: 08262093-n