hamlet-n
type: LexicalEntry
canonical form: hamlet
sense: 08243899-n
part of speech: noun

crossroads-n
type: LexicalEntry
canonical form: crossroads
sense: 08243899-n
part of speech: noun

08243899-n
type: LexicalConcept
in scheme: en-word.net
definition: a community of people smaller than a village
ili: i80345
lexfile: noun.group
part of speech: noun
hypernym: 08240723-n