house-n
type: LexicalEntry
canonical form: house
sense: 08241501-n
part of speech: noun

08241501-n
type: LexicalConcept
in scheme: en-word.net
definition: the members of a religious community living together
ili: i80330
lexfile: noun.group
part of speech: noun
hypernym: 08240723-n