chorus-n
type: LexicalEntry
canonical form: chorus
sense: 08204767-n
part of speech: noun

08204767-n
type: LexicalConcept
in scheme: en-word.net
definition: a group of people assembled to sing together
ili: i80177
lexfile: noun.group
part of speech: noun
hypernym: 08263534-n