citizenry-n
type: LexicalEntry
canonical form: citizenry
sense: 08177175-n
part of speech: noun

people-n
type: LexicalEntry
canonical form: people
sense: 08177175-n
part of speech: noun

08177175-n
type: LexicalConcept
in scheme: en-word.net
definition: the body of citizens of a state or country
example: the Spanish people
ili: i80034
lexfile: noun.group
part of speech: noun
hypernym: 00031563-n
mero member: 09943131-n