National Science Foundation-n
type: LexicalEntry
canonical form: National Science Foundation
sense: 08143903-n
part of speech: noun

NSF-n
type: LexicalEntry
canonical form: NSF
sense: 08143903-n
part of speech: noun

08143903-n
type: LexicalConcept
in scheme: en-word.net
definition: an independent agency of the federal government responsible for the promotion of progress in science and engineering by supporting programs in research and education
ili: i79889
lexfile: noun.group
part of speech: noun
hypernym: 08355774-n