ministry-n
type: LexicalEntry
canonical form: ministry
sense: 08130970-n
part of speech: noun

08130970-n
type: LexicalConcept
in scheme: en-word.net
definition: a government department under the direction of a minister of state
ili: i79825
lexfile: noun.group
part of speech: noun
hypernym: 08136796-n