ministry-n
type: LexicalEntry
canonical form: ministry
sense: 08130763-n
part of speech: noun

08130763-n
type: LexicalConcept
in scheme: en-word.net
definition: religious ministers collectively (especially Presbyterian)
ili: i79823
lexfile: noun.group
part of speech: noun
hypernym: 08130409-n