civilization-n
type: LexicalEntry
canonical form: civilization
sense: 08128749-n
part of speech: noun

civilisation-n
type: LexicalEntry
canonical form: civilisation
sense: 08128749-n
part of speech: noun

08128749-n
type: LexicalConcept
in scheme: en-word.net
definition: a society in an advanced state of social development (e.g., with complex legal and political and religious organizations)
example: the people slowly progressed from barbarism to civilization
ili: i79811
lexfile: noun.group
part of speech: noun
domain topic: 06157599-n
hypernym: 07982754-n