type-n
type: LexicalEntry
canonical form: type
sense: 08128385-n
part of speech: noun

08128385-n
type: LexicalConcept
in scheme: en-word.net
definition: (biology) the taxonomic group whose characteristics are used to define the next higher taxon
ili: i79809
lexfile: noun.group
part of speech: noun
domain topic: 06047178-n
hypernym: 08008892-n