association-n
type: LexicalEntry
canonical form: association
sense: 08066153-n
part of speech: noun

08066153-n
type: LexicalConcept
in scheme: en-word.net
definition: a formal organization of people or groups of people
example: he joined the Modern Language Association
ili: i79512
lexfile: noun.group
part of speech: noun
hypernym: 08024893-n
mero member: 08245586-n
mero member: 09836176-n