denomination-n
type: LexicalEntry
canonical form: denomination
sense: 08023431-n
part of speech: noun

08023431-n
type: LexicalConcept
in scheme: en-word.net
definition: a class of one kind of unit in a system of numbers or measures or weights or money
example: he flashed a fistful of bills of large denominations
ili: i79374
lexfile: noun.group
part of speech: noun
hypernym: 08014145-n