set-n
type: LexicalEntry
canonical form: set
sense: 08016141-n
part of speech: noun

08016141-n
type: LexicalConcept
in scheme: en-word.net
definition: (mathematics) an abstract collection of numbers or symbols
example: the set of prime numbers is infinite
ili: i79330
lexfile: noun.group
part of speech: noun
domain topic: 06009822-n
hypernym: 00002137-n