fauna-n
type: LexicalEntry
canonical form: fauna
sense: 08009721-n
part of speech: noun

zoology-n
type: LexicalEntry
canonical form: zoology
sense: 08009721-n
part of speech: noun

08009721-n
type: LexicalConcept
in scheme: en-word.net
definition: all the animal life in a particular region or period
example: the fauna of China
example: the zoology of the Pliocene epoch
ili: i79294
lexfile: noun.group
part of speech: noun
hypernym: 07968050-n
mero member: 08010371-n