contingent-n
type: LexicalEntry
canonical form: contingent
sense: 07992867-n
part of speech: noun

07992867-n
type: LexicalConcept
in scheme: en-word.net
definition: a gathering of persons representative of some larger group
example: each nation sent a contingent of athletes to the Olympics
ili: i79224
lexfile: noun.group
part of speech: noun
hypernym: 07991473-n