congregation-n
type: LexicalEntry
canonical form: congregation
sense: 07992628-n
part of speech: noun

07992628-n
type: LexicalConcept
in scheme: en-word.net
definition: an assemblage of people or animals or things collected together
example: a congregation of children pleaded for his autograph
example: a great congregation of birds flew over
ili: i79223
lexfile: noun.group
part of speech: noun
hypernym: 07968050-n