gathering-n
type: LexicalEntry
canonical form: gathering
sense: 07991473-n
part of speech: noun

assemblage-n
type: LexicalEntry
canonical form: assemblage
sense: 07991473-n
part of speech: noun

07991473-n
type: LexicalConcept
in scheme: en-word.net
definition: a group of persons together in one place
ili: i79220
lexfile: noun.group
part of speech: noun
hypernym: 07967506-n