sector-n
type: LexicalEntry
canonical form: sector
sense: 07983333-n
part of speech: noun

07983333-n
type: LexicalConcept
in scheme: en-word.net
definition: a social group that forms part of the society or the economy
example: the public sector
ili: i79184
lexfile: noun.group
part of speech: noun
hypernym: 07967506-n