combination-n
type: LexicalEntry
canonical form: combination
sense: 07980325-n
part of speech: noun

07980325-n
type: LexicalConcept
in scheme: en-word.net
definition: a collection of things that have been combined; an assemblage of separate parts or qualities
ili: i79172
lexfile: noun.group
part of speech: noun
hypernym: 07968050-n