pledge-n
type: LexicalEntry
canonical form: pledge
sense: 07900388-n
part of speech: noun

toast-n
type: LexicalEntry
canonical form: toast
sense: 07900388-n
part of speech: noun

07900388-n
type: LexicalConcept
in scheme: en-word.net
definition: a drink in honor of or to the health of a person or event
ili: i78672
lexfile: noun.food
part of speech: noun
hypernym: 07901198-n